Reaction Details
TargetcAMP and cAMP-inhibited cGMP 3',5'-cyclic phosphodiesterase 10A
LigandBDBM50242380
Substrate/Competitorn/a
Meas. Tech.ChEMBL_1671584 (CHEMBL4021613)
IC50 103±n/a nM
Citation Chen, LChen, DTang, LRen, JChen, JZhen, XLiu, YCZhang, CLuo, HShen, JXiong, B Design and optimization of purine derivatives as in vivo active PDE10A inhibitors. Bioorg Med Chem25:3315-3329 (2017) 
 
cAMP and cAMP-inhibited cGMP 3',5'-cyclic phosphodiesterase 10A
Name:cAMP and cAMP-inhibited cGMP 3',5'-cyclic phosphodiesterase 10A
Type:Protein
Mol. Mass.:88412.52
Organism:Homo sapiens (Human)
Description:Q9Y233
Residue:779
BDBM50242380
NameBDBM50242380
Synonyms:CHEMBL4090349
TypeSmall organic molecule
Emp. Form.C22H21N5O
Mol. Mass.371.435
SMILESC(c1ccc(cc1)-c1ccccc1)n1cnc2c(ncnc12)N1CCOCC1