Reaction Details
TargetcAMP and cAMP-inhibited cGMP 3',5'-cyclic phosphodiesterase 10A
LigandBDBM50242387
Substrate/Competitorn/a
Meas. Tech.ChEMBL_1671584 (CHEMBL4021613)
IC50 61±n/a nM
Citation Chen, LChen, DTang, LRen, JChen, JZhen, XLiu, YCZhang, CLuo, HShen, JXiong, B Design and optimization of purine derivatives as in vivo active PDE10A inhibitors. Bioorg Med Chem25:3315-3329 (2017) 
 
cAMP and cAMP-inhibited cGMP 3',5'-cyclic phosphodiesterase 10A
Name:cAMP and cAMP-inhibited cGMP 3',5'-cyclic phosphodiesterase 10A
Type:Protein
Mol. Mass.:88412.52
Organism:Homo sapiens (Human)
Description:Q9Y233
Residue:1055
BDBM50242387
NameBDBM50242387
Synonyms:CHEMBL4066336
TypeSmall organic molecule
Emp. Form.C22H22N6O
Mol. Mass.386.4497
SMILESCc1nc2c(ncnc2n1Cc1ccc(cc1)-c1cccnc1)N1CCOCC1