Reaction Details
TargetcAMP and cAMP-inhibited cGMP 3',5'-cyclic phosphodiesterase 10A
LigandBDBM50242389
Substrate/Competitorn/a
Meas. Tech.ChEMBL_1671584 (CHEMBL4021613)
IC50 76±n/a nM
Citation Chen, LChen, DTang, LRen, JChen, JZhen, XLiu, YCZhang, CLuo, HShen, JXiong, B Design and optimization of purine derivatives as in vivo active PDE10A inhibitors. Bioorg Med Chem25:3315-3329 (2017) 
 
cAMP and cAMP-inhibited cGMP 3',5'-cyclic phosphodiesterase 10A
Name:cAMP and cAMP-inhibited cGMP 3',5'-cyclic phosphodiesterase 10A
Type:Protein
Mol. Mass.:88412.52
Organism:Homo sapiens (Human)
Description:Q9Y233
Residue:779
BDBM50242389
NameBDBM50242389
Synonyms:CHEMBL4104051
TypeSmall organic molecule
Emp. Form.C21H21N7O
Mol. Mass.387.4377
SMILESCc1nc2c(ncnc2n1Cc1ccc(cc1)-c1cncnc1)N1CCOCC1