Reaction Details
TargetPeroxisome proliferator-activated receptor gamma
LigandBDBM50030474
Substrate/Competitorn/a
Meas. Tech.ChEMBL_1671634 (CHEMBL4021663)
EC50 1100±n/a nM
Citation Toyota, YNomura, SMakishima, MHashimoto, YIshikawa, M Structure-activity relationships of rosiglitazone for peroxisome proliferator-activated receptor gamma transrepression. Bioorg Med Chem Lett27:2776-2780 (2017) 
 
Peroxisome proliferator-activated receptor gamma
Name:Peroxisome proliferator-activated receptor gamma
Type:Nuclear Receptor
Mol. Mass.:57613.46
Organism:Homo sapiens (Human)
Description:P37231
Residue:505
BDBM50030474
NameBDBM50030474
Synonyms:Avandamet Avandia CHEBI:50122 US10744117, Compound Rosiglitazone | US9562012, rosiglitazone
TypeSmall organic molecule
Emp. Form.C18H19N3O3S
Mol. Mass.357.427
SMILESCN(CCOc1ccc(CC2SC(=O)NC2=O)cc1)c1ccccn1