Reaction Details
TargetAdenosine receptor A1
LigandBDBM50003024
Substrate/Competitorn/a
Meas. Tech.ChEBML_29418
Ki 3±n/a nM
Citation Suzuki, FShimada, JNonaka, HIshii, AShiozaki, SIchikawa, SOno, E 7,8-Dihydro-8-ethyl-2-(3-noradamantyl)-4-propyl-1H-imidazo[2,1-i]purin-5(4H)-one: a potent and water-soluble adenosine A1 antagonist. J Med Chem35:3578-81 (1992) Adenosine receptor A1
Name:Adenosine receptor A1
Type:Enzyme Catalytic Domain
Mol. Mass.:36501.39
Organism:GUINEA PIG
Description:ADENOSINE A1 ADORA1 GUINEA PIG::P47745
Residue:326
BDBM50003024
NameBDBM50003024
Synonyms:(8-(dicyclopropylmethyl)-1,3-dipropylxanthine)8-Dicyclopropylmethyl-1,3-dipropyl-3,7-dihydro-purine-2,6-dione CHEMBL84363
TypeSmall organic molecule
Emp. Form.C18H26N4O2
Mol. Mass.330.4246
SMILESCCCn1c2nc([nH]c2c(=O)n(CCC)c1=O)C(C1CC1)C1CC1