Reaction Details
TargetAdenosine receptor A2a/A2b
LigandBDBM50003019
Substrate/Competitorn/a
Meas. Tech.ChEBML_27631
Ki 430±n/a nM
Citation Suzuki, FShimada, JNonaka, HIshii, AShiozaki, SIchikawa, SOno, E 7,8-Dihydro-8-ethyl-2-(3-noradamantyl)-4-propyl-1H-imidazo[2,1-i]purin-5(4H)-one: a potent and water-soluble adenosine A1 antagonist. J Med Chem35:3578-81 (1992) Adenosine receptor A2a/A2b
Name:Adenosine receptor A2a/A2b
Synonyms:Adenosine A2 receptor
Type:n/a
Mol. Mass.:n/a
Description:ASSAY_ID of ChEMBL is 329906
Components:This complex has 2 components.
Component 1
Name:Adenosine receptor A2b
Type:G Protein-Coupled Receptor (GPCR)
Mol. Mass.:36341.22
Organism:Homo sapiens (Human)
Description:n/a
Residue:332
Component 2
Name:Adenosine receptor A2a
Synonyms:A2A adenosine receptor (hA2A) ADENOSINE A2 ADORA2 Adenosine A2A receptor (A2AAR)
Type:G Protein-Coupled Receptor (GPCR)
Mol. Mass.:44716.46
Organism:Homo sapiens (Human)
Description:P29274
Residue:412
BDBM50003019
NameBDBM50003019
Synonyms:8-(Hexahydro-2,5-methano-pentalen-3a-yl)-1,3-dipropyl-3,7-dihydro-purine-2,6-dione KW-3902
TypeSmall organic molecule
Emp. Form.C20H28N4O2
Mol. Mass.356.4619
SMILESCCCn1c2nc([nH]c2c(=O)n(CCC)c1=O)C12CC3CC1CC(C2)C3