Reaction Details
TargetSodium channel protein type 5 subunit alpha
LigandBDBM50242502
Substrate/Competitorn/a
Meas. Tech.ChEMBL_1671679 (CHEMBL4021708)
IC50>30000±n/a nM
Citation Pero, JERossi, MALehman, HDGFKelly, MJMulhearn, JJWolkenberg, SECato, MJClements, MKDaley, CJFilzen, TFinger, ENGregan, YHenze, DAJovanovska, AKlein, RKraus, RLLi, YLiang, AMajercak, JMPanigel, JUrban, MOWang, JWang, YHHoughton, AKLayton, ME Benzoxazolinone aryl sulfonamides as potent, selective Na Bioorg Med Chem Lett27:2683-2688 (2017) 
 
Sodium channel protein type 5 subunit alpha
Name:Sodium channel protein type 5 subunit alpha
Type:Enzyme
Mol. Mass.:226908.60
Organism:Homo sapiens (Human)
Description:Q14524
Residue:2016
BDBM50242502
NameBDBM50242502
Synonyms:CHEMBL4082170
TypeSmall organic molecule
Emp. Form.C16H12N4O4S2
Mol. Mass.388.421
SMILESO=c1oc2cc(ccc2n1Cc1ccccc1)S(=O)(=O)Nc1ncns1