Reaction Details
TargetSodium channel protein type 9 subunit alpha
LigandBDBM50242503
Substrate/Competitorn/a
Meas. Tech.ChEMBL_1671680 (CHEMBL4021709)
IC50 3026±n/a nM
Citation Pero, JERossi, MALehman, HDGFKelly, MJMulhearn, JJWolkenberg, SECato, MJClements, MKDaley, CJFilzen, TFinger, ENGregan, YHenze, DAJovanovska, AKlein, RKraus, RLLi, YLiang, AMajercak, JMPanigel, JUrban, MOWang, JWang, YHHoughton, AKLayton, ME Benzoxazolinone aryl sulfonamides as potent, selective Na Bioorg Med Chem Lett27:2683-2688 (2017) 
 
Sodium channel protein type 9 subunit alpha
Name:Sodium channel protein type 9 subunit alpha
Type:Protein
Mol. Mass.:226375.97
Organism:Homo sapiens (Human)
Description:Q15858
Residue:1988
BDBM50242503
NameBDBM50242503
Synonyms:CHEMBL4098657
TypeSmall organic molecule
Emp. Form.C16H13N5O2S2
Mol. Mass.371.437
SMILESO=S(=O)(Nc1ncns1)c1ccc2n(Cc3ccccc3)ncc2c1