Reaction Details
TargetTyrosine-protein kinase ABL1
LigandBDBM50242512
Substrate/Competitorn/a
Meas. Tech.ChEMBL_1671765 (CHEMBL4021794)
IC50>100000±n/a nM
Citation Fischer, TKrüger, TNajjar, ATotzke, FSchächtele, CSippl, WRitter, CHilgeroth, A Discovery of novel substituted benzo-anellated 4-benzylamino pyrrolopyrimidines as dual EGFR and VEGFR2 inhibitors. Bioorg Med Chem Lett27:2708-2712 (2017) 
 
Tyrosine-protein kinase ABL1
Name:Tyrosine-protein kinase ABL1
Type:Enzyme
Mol. Mass.:122897.30
Organism:Homo sapiens (Human)
Description:P00519
Residue:1130
BDBM50242512
NameBDBM50242512
Synonyms:CHEMBL4098682
TypeSmall organic molecule
Emp. Form.C19H19N5O
Mol. Mass.333.3871
SMILESCc1ccc(CNc2nc(N)nc3[nH]c4cc(C)c(O)cc4c23)cc1