Reaction Details
TargetEpidermal growth factor receptor
LigandBDBM50242521
Substrate/Competitorn/a
Meas. Tech.ChEMBL_1671751 (CHEMBL4021780)
Ki 5950±n/a nM
Citation Fischer, TKrüger, TNajjar, ATotzke, FSchächtele, CSippl, WRitter, CHilgeroth, A Discovery of novel substituted benzo-anellated 4-benzylamino pyrrolopyrimidines as dual EGFR and VEGFR2 inhibitors. Bioorg Med Chem Lett27:2708-2712 (2017) 
 
Epidermal growth factor receptor
Name:Epidermal growth factor receptor
Type:Receptor Kinase Domain
Mol. Mass.:134279.59
Organism:Homo sapiens (Human)
Description:P00533
Residue:1210
BDBM50242521
NameBDBM50242521
Synonyms:CHEMBL4072687
TypeSmall organic molecule
Emp. Form.C19H19N5O2
Mol. Mass.349.3865
SMILESCOc1ccc(CNc2nc(N)nc3[nH]c4cc(C)c(O)cc4c23)cc1