Reaction Details
TargetDeath-associated protein kinase 1
LigandBDBM50242512
Substrate/Competitorn/a
Meas. Tech.ChEMBL_1671755 (CHEMBL4021784)
IC50>100000±n/a nM
Citation Fischer, TKrüger, TNajjar, ATotzke, FSchächtele, CSippl, WRitter, CHilgeroth, A Discovery of novel substituted benzo-anellated 4-benzylamino pyrrolopyrimidines as dual EGFR and VEGFR2 inhibitors. Bioorg Med Chem Lett27:2708-2712 (2017) 
 
Death-associated protein kinase 1
Name:Death-associated protein kinase 1
Type:PROTEIN
Mol. Mass.:160053.35
Organism:Homo sapiens (Human)
Description:ChEMBL_1517177
Residue:1430
BDBM50242512
NameBDBM50242512
Synonyms:CHEMBL4098682
TypeSmall organic molecule
Emp. Form.C19H19N5O
Mol. Mass.333.3871
SMILESCc1ccc(CNc2nc(N)nc3[nH]c4cc(C)c(O)cc4c23)cc1