Reaction Details
TargetMitogen-activated protein kinase kinase kinase 21
LigandBDBM50242512
Substrate/Competitorn/a
Meas. Tech.ChEMBL_1671763 (CHEMBL4021792)
IC50>100000±n/a nM
Citation Fischer, TKrüger, TNajjar, ATotzke, FSchächtele, CSippl, WRitter, CHilgeroth, A Discovery of novel substituted benzo-anellated 4-benzylamino pyrrolopyrimidines as dual EGFR and VEGFR2 inhibitors. Bioorg Med Chem Lett27:2708-2712 (2017) 
 
Mitogen-activated protein kinase kinase kinase 21
Name:Mitogen-activated protein kinase kinase kinase 21
Type:PROTEIN
Mol. Mass.:113984.11
Organism:Homo sapiens
Description:ChEMBL_109906
Residue:1036
BDBM50242512
NameBDBM50242512
Synonyms:CHEMBL4098682
TypeSmall organic molecule
Emp. Form.C19H19N5O
Mol. Mass.333.3871
SMILESCc1ccc(CNc2nc(N)nc3[nH]c4cc(C)c(O)cc4c23)cc1