Reaction Details
TargetKappa-type opioid receptor
LigandBDBM50242676
Substrate/Competitorn/a
Meas. Tech.ChEMBL_1672057 (CHEMBL4022086)
Ki 0.158489±n/a nM
Citation Jiang, LBeattie, DTJacobsen, JRKintz, SObedencio, GPSaito, DStergiades, IVickery, RGLong, DD Discovery of N-substituted-endo-3-(8-aza-bicyclo[3.2.1]oct-3-yl)-phenol and -phenyl carboxamide series of?-opioid receptor antagonists. Bioorg Med Chem Lett27:2926-2930 (2017) 
 
Kappa-type opioid receptor
Name:Kappa-type opioid receptor
Type:G Protein-Coupled Receptor (GPCR)
Mol. Mass.:42744.99
Organism:Cavia porcellus (domestic guinea pig)
Description:P41144
Residue:380
BDBM50242676
NameBDBM50242676
Synonyms:CHEMBL4059786
TypeSmall organic molecule
Emp. Form.C23H28N2O
Mol. Mass.348.4812
SMILES[H][C@@]12CC[C@]([H])(CC(C1)c1cccc(c1)C(N)=O)N2CCCc1ccccc1