Reaction Details
TargetDelta-type opioid receptor
LigandBDBM50242673
Substrate/Competitorn/a
Meas. Tech.ChEMBL_1672056 (CHEMBL4022085)
Ki 0.794328±n/a nM
Citation Jiang, LBeattie, DTJacobsen, JRKintz, SObedencio, GPSaito, DStergiades, IVickery, RGLong, DD Discovery of N-substituted-endo-3-(8-aza-bicyclo[3.2.1]oct-3-yl)-phenol and -phenyl carboxamide series of?-opioid receptor antagonists. Bioorg Med Chem Lett27:2926-2930 (2017) 
 
Delta-type opioid receptor
Name:Delta-type opioid receptor
Type:G Protein-Coupled Receptor (GPCR)
Mol. Mass.:40382.98
Organism:Homo sapiens (Human)
Description:Competition binding assays were carried out using membrane preparations from transfected HN9.10 cells that constitutively expressed the delta opioid receptor.
Residue:372
BDBM50242673
NameBDBM50242673
Synonyms:CHEMBL4092037
TypeSmall organic molecule
Emp. Form.C22H27NO
Mol. Mass.321.4559
SMILES[H][C@@]12CC[C@]([H])(CC(C1)c1cccc(O)c1)N2CCCc1ccccc1