Reaction Details
TargetMu-type opioid receptor
LigandBDBM50242673
Substrate/Competitorn/a
Meas. Tech.ChEMBL_1672055 (CHEMBL4022084)
Ki 0.100000±n/a nM
Citation Jiang, LBeattie, DTJacobsen, JRKintz, SObedencio, GPSaito, DStergiades, IVickery, RGLong, DD Discovery of N-substituted-endo-3-(8-aza-bicyclo[3.2.1]oct-3-yl)-phenol and -phenyl carboxamide series of?-opioid receptor antagonists. Bioorg Med Chem Lett27:2926-2930 (2017) 
 
Mu-type opioid receptor
Name:Mu-type opioid receptor
Type:G Protein-Coupled Receptor (GPCR)
Mol. Mass.:44789.51
Organism:Homo sapiens (Human)
Description:P35372
Residue:400
BDBM50242673
NameBDBM50242673
Synonyms:CHEMBL4092037
TypeSmall organic molecule
Emp. Form.C22H27NO
Mol. Mass.321.4559
SMILES[H][C@@]12CC[C@]([H])(CC(C1)c1cccc(O)c1)N2CCCc1ccccc1