Reaction Details
TargetInterleukin-1 receptor-associated kinase 4
LigandBDBM50242698
Substrate/Competitorn/a
Meas. Tech.ChEMBL_1672106 (CHEMBL4022135)
IC50 3.0±n/a nM
Citation Smith, GFAltman, MDAndresen, BBaker, JBrubaker, JDChen, HChen, YChilders, MDonofrio, AFerguson, HFischer, CFischmann, TOGibeau, CHicks, AJin, SKattar, SKleinschek, MALeccese, ELesburg, CLi, CLim, JLiu, DMaclean, JKFMansoor, FMoy, LYMulrooney, EFNecheva, ASPresland, JRakhilina, LYang, RTorres, LZhang-Hoover, JNorthrup, A Identification of quinazoline based inhibitors of IRAK4 for the treatment of inflammation. Bioorg Med Chem Lett27:2721-2726 (2017) 
 
Interleukin-1 receptor-associated kinase 4
Name:Interleukin-1 receptor-associated kinase 4
Type:Protein
Mol. Mass.:51519.08
Organism:Homo sapiens (Human)
Description:Q9NWZ3
Residue:460
BDBM50242698
NameBDBM50242698
Synonyms:CHEMBL4069200 | US9932350, 3-54
TypeSmall organic molecule
Emp. Form.C20H23F2N5
Mol. Mass.371.4269
SMILESFC1(F)CCN(CC1)[C@H]1CC[C@@H](CC1)Nc1ncnc2ccc(cc12)C#N