Reaction Details
TargetType-1 angiotensin II receptor B
LigandBDBM50003158
Substrate/Competitorn/a
Meas. Tech.ChEBML_34834
Ki 2.8±n/a nM
Citation De, BWinn, MZydowsky, TMKerkman, DJDeBernardis, JFLee, JBuckner, SWarner, RBrune, MHancock, A Discovery of a novel class of orally active, non-peptide angiotensin II antagonists. J Med Chem35:3714-7 (1992) Type-1 angiotensin II receptor B
Name:Type-1 angiotensin II receptor B
Type:Enzyme Catalytic Domain
Mol. Mass.:40929.44
Organism:RAT
Description:Angiotensin II AT1B 0 RAT::P29089
Residue:359
BDBM50003158
NameBDBM50003158
Synonyms:2-Methyl-4-{propyl-[2'-(1H-tetrazol-5-yl)-biphenyl-4-ylmethyl]-amino}-pyrimidine-5-carboxylic acid CHEMBL421473
TypeSmall organic molecule
Emp. Form.C23H23N7O2
Mol. Mass.429.4744
SMILESCCCN(Cc1ccc(cc1)-c1ccccc1-c1nnn[nH]1)c1nc(C)ncc1C(O)=O