Reaction Details
TargetGastrin/cholecystokinin type B receptor
LigandBDBM50003207
Substrate/Competitorn/a
Meas. Tech.ChEBML_47804
IC50 5±n/a nM
Citation Tilley, JWDanho, WShiuey, SJKulesha, ISwistok, JMakofske, RMichalewsky, JTriscari, JNelson, DWeatherford, S Analogs of Ac-CCK-7 incorporating dipeptide mimics in place of Met28-Gly29. J Med Chem35:3774-83 (1992) Gastrin/cholecystokinin type B receptor
Name:Gastrin/cholecystokinin type B receptor
Type:PROTEIN
Mol. Mass.:48807.54
Organism:Bos taurus
Description:ChEMBL_48437
Residue:454
BDBM50003207
NameBDBM50003207
Synonyms:CHEMBL405805 | N-(1-Carbamoyl-2-phenyl-ethyl)-3-{2-[2-{5-[2-carboxyamino-3-(4-sulfo-phenyl)-propionylamino]-2-methyl-benzoylamino}-3-(1H-indol-3-yl)-propionylamino]-4-methylsulfanyl-butyrylamino}-succinamic acid
TypeSmall organic molecule
Emp. Form.C47H52N8O13S2
Mol. Mass.1001.092
SMILESCSCC[C@H](NC(=O)[C@H](Cc1c[nH]c2ccccc12)NC(=O)c1cc(NC(=O)[C@H](Cc2ccc(cc2)S(O)(=O)=O)NC(O)=O)ccc1C)C(=O)N[C@@H](CC(O)=O)C(=O)N[C@@H](Cc1ccccc1)C(N)=O