Reaction Details
TargetSialidase A
LigandBDBM50182491
Substrate/Competitorn/a
Meas. Tech.ChEMBL_1672432 (CHEMBL4022461)
Ki 100±n/a nM
Citation Park, JYHwan Lim, SRam Kim, BJae Jeong, HKwon, HJSong, GYBae Ryu, YSong Lee, W Sialidase inhibitory activity of diarylnonanoid and neolignan compounds extracted from the seeds of Myristica fragrans. Bioorg Med Chem Lett27:3060-3064 (2017) 
 
Sialidase A
Name:Sialidase A
Type:Enzyme
Mol. Mass.:114737.08
Organism:Streptococcus pneumoniae
Description:P62576; spr1536
Residue:1035
BDBM50182491
NameBDBM50182491
Synonyms:CHEBI:69015 | Malabaricone C
TypeSmall organic molecule
Emp. Form.C21H26O5
Mol. Mass.358.4281
SMILESOc1ccc(CCCCCCCCC(=O)c2c(O)cccc2O)cc1O