Reaction Details
TargetDisintegrin and metalloproteinase domain-containing protein 17
LigandBDBM50243057
Substrate/Competitorn/a
Meas. Tech.ChEBML_1672502
Ki 0.400000±n/a nM
Citation Tong, LKim, SHRosner, KYu, WShankar, BBChen, LLi, DDai, CGirijavallabhan, VPopovici-Muller, JYang, LZhou, GKosinski, ASiddiqui, MAShih, NYGuo, ZOrth, PChen, SLundell, DNiu, XUmland, SKozlowski, JA Fused bi-heteroaryl substituted hydantoin compounds as TACE inhibitors. Bioorg Med Chem Lett27:3037-3042 (2017) 
 
Disintegrin and metalloproteinase domain-containing protein 17
Name:Disintegrin and metalloproteinase domain-containing protein 17
Type:Enzyme
Mol. Mass.:93007.89
Organism:Homo sapiens (Human)
Description:
Residue:824
BDBM50243057
NameBDBM50243057
Synonyms:CHEMBL4104084
TypeSmall organic molecule
Emp. Form.C21H15F3N4O5
Mol. Mass.460.3628
SMILESCOc1ccc2CN(C[C@]3(NC(=O)NC3=O)c3cc4c(nccc4o3)C(F)(F)F)C(=O)c2c1