Reaction Details
TargetDisintegrin and metalloproteinase domain-containing protein 17
LigandBDBM50243092
Substrate/Competitorn/a
Meas. Tech.ChEBML_1672502
Ki 0.400000±n/a nM
Citation Tong, LKim, SHRosner, KYu, WShankar, BBChen, LLi, DDai, CGirijavallabhan, VPopovici-Muller, JYang, LZhou, GKosinski, ASiddiqui, MAShih, NYGuo, ZOrth, PChen, SLundell, DNiu, XUmland, SKozlowski, JA Fused bi-heteroaryl substituted hydantoin compounds as TACE inhibitors. Bioorg Med Chem Lett27:3037-3042 (2017) 
 
Disintegrin and metalloproteinase domain-containing protein 17
Name:Disintegrin and metalloproteinase domain-containing protein 17
Type:Enzyme
Mol. Mass.:93007.89
Organism:Homo sapiens (Human)
Description:
Residue:824
BDBM50243092
NameBDBM50243092
Synonyms:CHEMBL4088194
TypeSmall organic molecule
Emp. Form.C28H28N8O5
Mol. Mass.556.5725
SMILESCOc1ccc2CN(C[C@]3(NC(=O)NC3=O)c3cc4nc(ccc4o3)N(C3CCNCC3)c3cn[nH]c3)C(=O)c2c1