Reaction Details
TargetMuscarinic acetylcholine receptor M1
LigandBDBM50003366
Substrate/Competitorn/a
Meas. Tech.ChEBML_165078
IC50 0.004000±n/a nM
Citation Ward, JSMerritt, LKlimkowski, VJLamb, MLMitch, CHBymaster, FPSawyer, BShannon, HEOlesen, PHHonoré, T Novel functional M1 selective muscarinic agonists. 2. Synthesis and structure-activity relationships of 3-pyrazinyl-1,2,5,6-tetrahydro-1-methylpyridines. Construction of a molecular model for the M1 pharmacophore. J Med Chem35:4011-9 (1992) Muscarinic acetylcholine receptor M1
Name:Muscarinic acetylcholine receptor M1
Type:Protein
Mol. Mass.:51442.54
Organism:Homo sapiens (Human)
Description:P11229
Residue:460
BDBM50003366
NameBDBM50003366
Synonyms:1-Methyl-5-(4-pentyloxy-[1,2,5]thiadiazol-3-yl)-1,2,3,6-tetrahydro-pyridine 1-methyl-5-(4-(pentyloxy)-1,2,5-thiadiazol-3-yl)-1,2,3,6-tetrahydropyridine CHEMBL75552
TypeSmall organic molecule
Emp. Form.C13H21N3OS
Mol. Mass.267.39
SMILESCCCCCOc1nsnc1C1=CCCN(C)C1