Reaction Details
TargetMuscarinic acetylcholine receptor M1
LigandBDBM50003351
Substrate/Competitorn/a
Meas. Tech.ChEMBL_138802 (CHEMBL751537)
IC50 1.4±n/a nM
Citation Ward, JSMerritt, LKlimkowski, VJLamb, MLMitch, CHBymaster, FPSawyer, BShannon, HEOlesen, PHHonoré, T Novel functional M1 selective muscarinic agonists. 2. Synthesis and structure-activity relationships of 3-pyrazinyl-1,2,5,6-tetrahydro-1-methylpyridines. Construction of a molecular model for the M1 pharmacophore. J Med Chem35:4011-9 (1992) Muscarinic acetylcholine receptor M1
Name:Muscarinic acetylcholine receptor M1
Type:Enzyme Catalytic Domain
Mol. Mass.:51390.46
Organism:RAT
Description:P08482
Residue:460
BDBM50003351
NameBDBM50003351
Synonyms:3-(4-butoxy-1,2,5-thiadiazol-3-yl)-1-methyl-1,2,5,6-tetrahydropyridine 5-(4-Butoxy-[1,2,5]thiadiazol-3-yl)-1-methyl-1,2,3,6-tetrahydro-pyridine; oxalic acid | CHEMBL101054
TypeSmall organic molecule
Emp. Form.C12H19N3OS
Mol. Mass.253.364
SMILESCCCCOc1nsnc1C1=CCCN(C)C1