Reaction Details
TargetPolyunsaturated fatty acid 5-lipoxygenase
LigandBDBM50003451
Substrate/Competitorn/a
Meas. Tech.ChEBML_3958
IC50 60±n/a nM
Citation Wright, SWHarris, RRKerr, JSGreen, AMPinto, DJBruin, EMCollins, RJDorow, RLMantegna, LRSherk, SR Synthesis, chemical, and biological properties of vinylogous hydroxamic acids: dual inhibitors of 5-lipoxygenase and IL-1 biosynthesis. J Med Chem35:4061-8 (1992) Polyunsaturated fatty acid 5-lipoxygenase
Name:Polyunsaturated fatty acid 5-lipoxygenase
Type:PROTEIN
Mol. Mass.:78082.31
Organism:Rattus norvegicus
Description:ChEMBL_1432947
Residue:673
BDBM50003451
NameBDBM50003451
Synonyms:(Z)-1-Biphenyl-4-yl-3-(hydroxy-methyl-amino)-propenone CHEMBL274187
TypeSmall organic molecule
Emp. Form.C16H15NO2
Mol. Mass.253.2958
SMILESCN(O)\C=C/C(=O)c1ccc(cc1)-c1ccccc1