Reaction Details
TargetAP2-associated protein kinase 1
LigandBDBM311159
Substrate/Competitorn/a
Meas. Tech.ChEMBL_1672603 (CHEMBL4022632)
IC50 0.420000±n/a nM
Citation Abdel-Magid, AF Inhibitors of Adaptor-Associated Kinase 1 (AAK1) May Treat Neuropathic Pain, Schizophrenia, Parkinson's Disease, and Other Disorders. ACS Med Chem Lett8:595-597 (2017) 
 
AP2-associated protein kinase 1
Name:AP2-associated protein kinase 1
Type:PROTEIN
Mol. Mass.:103884.23
Organism:Homo sapiens (Human)
Description:ChEMBL_774569
Residue:961
BDBM311159
NameBDBM311159
Synonyms:(S)-N-(4-(4-((2-amino-4-methylpentyl)oxy)-3-methylphenyl)pyridin-2-yl)acetamide BDBM50243381 US10723734, Example 7 | US9902722, Example 7
TypeSmall organic molecule
Emp. Form.C20H27N3O2
Mol. Mass.341.4473
SMILESCC(C)C[C@H](N)COc1ccc(cc1C)-c1ccnc(NC(C)=O)c1