Reaction Details
TargetCannabinoid receptor 1
LigandBDBM50243626
Substrate/Competitorn/a
Meas. Tech.ChEMBL_1672800 (CHEMBL4022829)
Ki 0.125893±n/a nM
Citation Xia, Lde Vries, HLenselink, EBLouvel, JWaring, MJCheng, LPahlén, SPetersson, MJSchell, POlsson, RIHeitman, LHSheppard, RJIJzerman, AP Structure-Affinity Relationships and Structure-Kinetic Relationships of 1,2-Diarylimidazol-4-carboxamide Derivatives as Human Cannabinoid 1 Receptor Antagonists. J Med Chem60:9545-9564 (2017) 
 
Cannabinoid receptor 1
Name:Cannabinoid receptor 1
Type:G Protein-Coupled Receptor (GPCR)
Mol. Mass.:52868.96
Organism:Homo sapiens (Human)
Description:P21554
Residue:472
BDBM50243626
NameBDBM50243626
Synonyms:CHEMBL4089821
TypeSmall organic molecule
Emp. Form.C26H21Cl2F3N4O4S
Mol. Mass.613.436
SMILESCc1c(nc(-c2ccc(Cl)cc2Cl)n1-c1ccc(OS(=O)(=O)CCC(F)(F)F)cc1)C(=O)Nc1ccc(C)cn1