Reaction Details
TargetCannabinoid receptor 1
LigandBDBM50243545
Substrate/Competitorn/a
Meas. Tech.ChEMBL_1672800 (CHEMBL4022829)
Ki 0.100±n/a nM
Citation Xia, Lde Vries, HLenselink, EBLouvel, JWaring, MJCheng, LPahlén, SPetersson, MJSchell, POlsson, RIHeitman, LHSheppard, RJIJzerman, AP Structure-Affinity Relationships and Structure-Kinetic Relationships of 1,2-Diarylimidazol-4-carboxamide Derivatives as Human Cannabinoid 1 Receptor Antagonists. J Med Chem60:9545-9564 (2017) 
 
Cannabinoid receptor 1
Name:Cannabinoid receptor 1
Type:G Protein-Coupled Receptor (GPCR)
Mol. Mass.:52868.96
Organism:Homo sapiens (Human)
Description:P21554
Residue:472
BDBM50243545
NameBDBM50243545
Synonyms:CHEMBL4078689
TypeSmall organic molecule
Emp. Form.C25H27Cl2FN4O2
Mol. Mass.505.412
SMILESCc1c(nc(-c2ccc(Cl)cc2Cl)n1-c1ccc(OCCCF)cc1)C(=O)NN1CCCCC1