Reaction Details
TargetCannabinoid receptor 1
LigandBDBM50243637
Substrate/Competitorn/a
Meas. Tech.ChEMBL_1672800 (CHEMBL4022829)
Ki 0.501187±n/a nM
Citation Xia, Lde Vries, HLenselink, EBLouvel, JWaring, MJCheng, LPahlén, SPetersson, MJSchell, POlsson, RIHeitman, LHSheppard, RJIJzerman, AP Structure-Affinity Relationships and Structure-Kinetic Relationships of 1,2-Diarylimidazol-4-carboxamide Derivatives as Human Cannabinoid 1 Receptor Antagonists. J Med Chem60:9545-9564 (2017) 
 
Cannabinoid receptor 1
Name:Cannabinoid receptor 1
Type:G Protein-Coupled Receptor (GPCR)
Mol. Mass.:52868.96
Organism:Homo sapiens (Human)
Description:P21554
Residue:472
BDBM50243637
NameBDBM50243637
Synonyms:CHEMBL4068853
TypeSmall organic molecule
Emp. Form.C28H34Cl2N4O4S
Mol. Mass.593.565
SMILESCc1c(nc(-c2ccc(Cl)cc2Cl)n1-c1ccc(OS(=O)(=O)CCC(C)(C)C)cc1)C(=O)NN1CCCCC1