Reaction Details
TargetTyrosine-protein kinase JAK1
LigandBDBM50243870
Substrate/Competitorn/a
Meas. Tech.ChEMBL_1672940 (CHEMBL4022969)
IC50 141±n/a nM
Citation Vazquez, MLKaila, NStrohbach, JWTrzupek, JDBrown, MFFlanagan, MEMitton-Fry, MJJohnson, TATenBrink, REArnold, EPBasak, AHeasley, SEKwon, SLangille, JParikh, MDGriffin, SHCasavant, JMDuclos, BAFenwick, AEHarris, TMHan, SCaspers, NDowty, MEYang, XBanker, MEHegen, MSymanowicz, PTLi, LWang, LLin, THJussif, JClark, JDTelliez, JBRobinson, RPUnwalla, R Identification of N-{cis-3-[Methyl(7H-pyrrolo[2,3-d]pyrimidin-4-yl)amino]cyclobutyl}propane-1-sulfonamide (PF-04965842): A Selective JAK1 Clinical Candidate for the Treatment of Autoimmune Diseases. J Med Chem61:1130-1152 (2018) 
 
Tyrosine-protein kinase JAK1
Name:Tyrosine-protein kinase JAK1
Type:Protein
Mol. Mass.:133293.73
Organism:Homo sapiens (Human)
Description:P23458
Residue:1154
BDBM50243870
NameBDBM50243870
Synonyms:CHEMBL4071850
TypeSmall organic molecule
Emp. Form.C13H20N6O2S
Mol. Mass.324.402
SMILESCCNS(=O)(=O)N[C@H]1C[C@H](C1)N(C)c1ncnc2[nH]ccc12