Reaction Details
TargetTyrosine-protein kinase JAK2
LigandBDBM50243852
Substrate/Competitorn/a
Meas. Tech.ChEMBL_1672941 (CHEMBL4022970)
IC50 240±n/a nM
Citation Vazquez, MLKaila, NStrohbach, JWTrzupek, JDBrown, MFFlanagan, MEMitton-Fry, MJJohnson, TATenBrink, REArnold, EPBasak, AHeasley, SEKwon, SLangille, JParikh, MDGriffin, SHCasavant, JMDuclos, BAFenwick, AEHarris, TMHan, SCaspers, NDowty, MEYang, XBanker, MEHegen, MSymanowicz, PTLi, LWang, LLin, THJussif, JClark, JDTelliez, JBRobinson, RPUnwalla, R Identification of N-{cis-3-[Methyl(7H-pyrrolo[2,3-d]pyrimidin-4-yl)amino]cyclobutyl}propane-1-sulfonamide (PF-04965842): A Selective JAK1 Clinical Candidate for the Treatment of Autoimmune Diseases. J Med Chem61:1130-1152 (2018) 
 
Tyrosine-protein kinase JAK2
Name:Tyrosine-protein kinase JAK2
Type:Protein
Mol. Mass.:130684.68
Organism:Homo sapiens (Human)
Description:O60674
Residue:1132
BDBM50243852
NameBDBM50243852
Synonyms:CHEMBL4103698
TypeSmall organic molecule
Emp. Form.C17H18FN5O2S
Mol. Mass.375.421
SMILESCN([C@@H]1C[C@@H](C1)NS(=O)(=O)c1ccc(F)cc1)c1ncnc2[nH]ccc12