Reaction Details
TargetNon-receptor tyrosine-protein kinase TYK2
LigandBDBM50243899
Substrate/Competitorn/a
Meas. Tech.ChEMBL_1672948 (CHEMBL4022977)
IC50>200000±n/a nM
Citation Vazquez, MLKaila, NStrohbach, JWTrzupek, JDBrown, MFFlanagan, MEMitton-Fry, MJJohnson, TATenBrink, REArnold, EPBasak, AHeasley, SEKwon, SLangille, JParikh, MDGriffin, SHCasavant, JMDuclos, BAFenwick, AEHarris, TMHan, SCaspers, NDowty, MEYang, XBanker, MEHegen, MSymanowicz, PTLi, LWang, LLin, THJussif, JClark, JDTelliez, JBRobinson, RPUnwalla, R Identification of N-{cis-3-[Methyl(7H-pyrrolo[2,3-d]pyrimidin-4-yl)amino]cyclobutyl}propane-1-sulfonamide (PF-04965842): A Selective JAK1 Clinical Candidate for the Treatment of Autoimmune Diseases. J Med Chem61:1130-1152 (2018) 
 
Non-receptor tyrosine-protein kinase TYK2
Name:Non-receptor tyrosine-protein kinase TYK2
Type:Protein
Mol. Mass.:133666.03
Organism:Homo sapiens (Human)
Description:P29597
Residue:1187
BDBM50243899
NameBDBM50243899
Synonyms:CHEMBL4089286
TypeSmall organic molecule
Emp. Form.C14H21N5O2S
Mol. Mass.323.414
SMILESCCNS(=O)(=O)C[C@H]1C[C@H](C1)N(C)c1ncnc2[nH]ccc12