Reaction Details
TargetTyrosine-protein kinase JAK1
LigandBDBM50243857
Substrate/Competitorn/a
Meas. Tech.ChEMBL_1672940 (CHEMBL4022969)
IC50 57±n/a nM
Citation Vazquez, MLKaila, NStrohbach, JWTrzupek, JDBrown, MFFlanagan, MEMitton-Fry, MJJohnson, TATenBrink, REArnold, EPBasak, AHeasley, SEKwon, SLangille, JParikh, MDGriffin, SHCasavant, JMDuclos, BAFenwick, AEHarris, TMHan, SCaspers, NDowty, MEYang, XBanker, MEHegen, MSymanowicz, PTLi, LWang, LLin, THJussif, JClark, JDTelliez, JBRobinson, RPUnwalla, R Identification of N-{cis-3-[Methyl(7H-pyrrolo[2,3-d]pyrimidin-4-yl)amino]cyclobutyl}propane-1-sulfonamide (PF-04965842): A Selective JAK1 Clinical Candidate for the Treatment of Autoimmune Diseases. J Med Chem61:1130-1152 (2018) 
 
Tyrosine-protein kinase JAK1
Name:Tyrosine-protein kinase JAK1
Type:Protein
Mol. Mass.:133293.73
Organism:Homo sapiens (Human)
Description:P23458
Residue:1154
BDBM50243857
NameBDBM50243857
Synonyms:CHEMBL4100048
TypeSmall organic molecule
Emp. Form.C14H20N4O2S
Mol. Mass.308.399
SMILESCCS(=O)(=O)C[C@H]1C[C@H](C1)N(C)c1ncnc2[nH]ccc12