Reaction Details
TargetTyrosine-protein kinase JAK2
LigandBDBM50193995
Substrate/Competitorn/a
Meas. Tech.ChEMBL_1672941 (CHEMBL4022970)
IC50 77±n/a nM
Citation Vazquez, MLKaila, NStrohbach, JWTrzupek, JDBrown, MFFlanagan, MEMitton-Fry, MJJohnson, TATenBrink, REArnold, EPBasak, AHeasley, SEKwon, SLangille, JParikh, MDGriffin, SHCasavant, JMDuclos, BAFenwick, AEHarris, TMHan, SCaspers, NDowty, MEYang, XBanker, MEHegen, MSymanowicz, PTLi, LWang, LLin, THJussif, JClark, JDTelliez, JBRobinson, RPUnwalla, R Identification of N-{cis-3-[Methyl(7H-pyrrolo[2,3-d]pyrimidin-4-yl)amino]cyclobutyl}propane-1-sulfonamide (PF-04965842): A Selective JAK1 Clinical Candidate for the Treatment of Autoimmune Diseases. J Med Chem61:1130-1152 (2018) 
 
Tyrosine-protein kinase JAK2
Name:Tyrosine-protein kinase JAK2
Type:Protein
Mol. Mass.:130684.68
Organism:Homo sapiens (Human)
Description:O60674
Residue:1132
BDBM50193995
NameBDBM50193995
Synonyms:3-((3R,4R)-4-methyl-3-(methyl(7H-pyrrolo[2,3-d]pyrimidin-4-yl)amino)piperidin-1-yl)-3-oxopropanenitrile 3-{(3R,4R)-4-methyl-3-[methyl(7H-pyrrolo[2,3-d]pyrimidin-4-yl)amino]piperidin-1-yl}-3-oxopropanenitrile CP-690550 Tofacitinib US10112907, Example 00035 US10766894, Compound TABLE 1.20 US11078206, Example Tofacitinib US11339167, Example Tofacitinib
TypeSmall organic molecule
Emp. Form.C16H20N6O
Mol. Mass.312.3696
SMILESC[C@@H]1CCN(C[C@@H]1N(C)c1ncnc2[nH]ccc12)C(=O)CC#N