Reaction Details
TargetInduced myeloid leukemia cell differentiation protein Mcl-1
LigandBDBM50244170
Substrate/Competitorn/a
Meas. Tech.ChEMBL_1673169 (CHEMBL4023198)
Ki 0.310000±n/a nM
Citation Shaw, SBian, ZZhao, BTarr, JCVeerasamy, NJeon, KOBelmar, JArnold, ALFogarty, SAPerry, ESensintaffar, JLCamper, DVRossanese, OWLee, TOlejniczak, ETFesik, SW Optimization of Potent and Selective Tricyclic Indole Diazepinone Myeloid Cell Leukemia-1 Inhibitors Using Structure-Based Design. J Med Chem61:2410-2421 (2018) 
 
Induced myeloid leukemia cell differentiation protein Mcl-1
Name:Induced myeloid leukemia cell differentiation protein Mcl-1
Type:Membrane; Single-pass membrane protein
Mol. Mass.:37332.87
Organism:Homo sapiens (Human)
Description:Q07820
Residue:350
BDBM50244170
NameBDBM50244170
Synonyms:CHEMBL4082941 US11208415, Example I-351
TypeSmall organic molecule
Emp. Form.C40H38Cl2N4O4
Mol. Mass.709.66
SMILESCc1nn(C)c(C)c1-c1c(Cl)ccc2c(CCCOc3cc(C)c(Cl)c(C)c3)c3C(=O)N(CCCn3c12)c1cccc2c(cccc12)C(O)=O