Reaction Details
TargetInduced myeloid leukemia cell differentiation protein Mcl-1
LigandBDBM50244153
Substrate/Competitorn/a
Meas. Tech.ChEMBL_1673169 (CHEMBL4023198)
Ki 0.240000±n/a nM
Citation Shaw, SBian, ZZhao, BTarr, JCVeerasamy, NJeon, KOBelmar, JArnold, ALFogarty, SAPerry, ESensintaffar, JLCamper, DVRossanese, OWLee, TOlejniczak, ETFesik, SW Optimization of Potent and Selective Tricyclic Indole Diazepinone Myeloid Cell Leukemia-1 Inhibitors Using Structure-Based Design. J Med Chem61:2410-2421 (2018) 
 
Induced myeloid leukemia cell differentiation protein Mcl-1
Name:Induced myeloid leukemia cell differentiation protein Mcl-1
Type:Membrane; Single-pass membrane protein
Mol. Mass.:37332.87
Organism:Homo sapiens (Human)
Description:Q07820
Residue:350
BDBM50244153
NameBDBM50244153
Synonyms:CHEMBL4087636 | US11596639, Example 68
TypeSmall organic molecule
Emp. Form.C39H39Cl2N5O4
Mol. Mass.712.664
SMILESCc1nn(C)c(C)c1-c1c(Cl)ccc2c(CCCOc3cc(C)c(Cl)c(C)c3)c3C(=O)N(CCCn3c12)c1cn(C)c2cc(ccc12)C(O)=O