Reaction Details
TargetInduced myeloid leukemia cell differentiation protein Mcl-1
LigandBDBM50244174
Substrate/Competitorn/a
Meas. Tech.ChEMBL_1673167 (CHEMBL4023196)
Ki 3.8±n/a nM
Citation Shaw, SBian, ZZhao, BTarr, JCVeerasamy, NJeon, KOBelmar, JArnold, ALFogarty, SAPerry, ESensintaffar, JLCamper, DVRossanese, OWLee, TOlejniczak, ETFesik, SW Optimization of Potent and Selective Tricyclic Indole Diazepinone Myeloid Cell Leukemia-1 Inhibitors Using Structure-Based Design. J Med Chem61:2410-2421 (2018) 
 
Induced myeloid leukemia cell differentiation protein Mcl-1
Name:Induced myeloid leukemia cell differentiation protein Mcl-1
Type:Membrane; Single-pass membrane protein
Mol. Mass.:37332.87
Organism:Homo sapiens (Human)
Description:Q07820
Residue:350
BDBM50244174
NameBDBM50244174
Synonyms:CHEMBL4087084 US11208415, Example I-87
TypeSmall organic molecule
Emp. Form.C37H38Cl2N4O4
Mol. Mass.673.628
SMILESCc1nn(C)c(C)c1-c1c(Cl)ccc2c(CCCOc3cc(C)c(Cl)c(C)c3)c3C(=O)N(Cc4ccc(cc4)C(O)=O)CCCn3c12