Reaction Details
TargetInduced myeloid leukemia cell differentiation protein Mcl-1
LigandBDBM50244173
Substrate/Competitorn/a
Meas. Tech.ChEMBL_1673166 (CHEMBL4023195)
Ki 2.9±n/a nM
Citation Shaw, SBian, ZZhao, BTarr, JCVeerasamy, NJeon, KOBelmar, JArnold, ALFogarty, SAPerry, ESensintaffar, JLCamper, DVRossanese, OWLee, TOlejniczak, ETFesik, SW Optimization of Potent and Selective Tricyclic Indole Diazepinone Myeloid Cell Leukemia-1 Inhibitors Using Structure-Based Design. J Med Chem61:2410-2421 (2018) 
 
Induced myeloid leukemia cell differentiation protein Mcl-1
Name:Induced myeloid leukemia cell differentiation protein Mcl-1
Type:Membrane; Single-pass membrane protein
Mol. Mass.:37332.87
Organism:Homo sapiens (Human)
Description:Q07820
Residue:350
BDBM50244173
NameBDBM50244173
Synonyms:CHEMBL4064491 US11208415, Example I-103
TypeSmall organic molecule
Emp. Form.C35H36Cl2N4O5
Mol. Mass.663.59
SMILESCc1nn(C)c(C)c1-c1c(Cl)ccc2c(CCCOc3cc(C)c(Cl)c(C)c3)c3C(=O)N(Cc4ccc(o4)C(O)=O)CCCn3c12