Reaction Details
TargetApoptosis regulator Bcl-2
LigandBDBM50244143
Substrate/Competitorn/a
Meas. Tech.ChEMBL_1673175 (CHEMBL4023204)
Ki 520±n/a nM
Citation Shaw, SBian, ZZhao, BTarr, JCVeerasamy, NJeon, KOBelmar, JArnold, ALFogarty, SAPerry, ESensintaffar, JLCamper, DVRossanese, OWLee, TOlejniczak, ETFesik, SW Optimization of Potent and Selective Tricyclic Indole Diazepinone Myeloid Cell Leukemia-1 Inhibitors Using Structure-Based Design. J Med Chem61:2410-2421 (2018) 
 
Apoptosis regulator Bcl-2
Name:Apoptosis regulator Bcl-2
Type:Homodimer or heterodimer
Mol. Mass.:26269.11
Organism:Homo sapiens (Human)
Description:P10415
Residue:239
BDBM50244143
NameBDBM50244143
Synonyms:CHEMBL4064897 US11208415, Example I-251
TypeSmall organic molecule
Emp. Form.C39H39Cl2N5O4
Mol. Mass.712.664
SMILESCc1nn(C)c(C)c1-c1c(Cl)ccc2c(CCCOc3cc(C)c(Cl)c(C)c3)c3C(=O)N(CCCn3c12)c1cc(cc2ccn(C)c12)C(O)=O