Reaction Details
TargetSigma non-opioid intracellular receptor 1
LigandBDBM50000069
Substrate/Competitorn/a
Meas. Tech.ChEBML_201725
Ki 2.1±n/a nM
Citation de Costa, BRDominguez, CHe, XSWilliams, WRadesca, LBowen, W Synthesis and biological evaluation of conformationally restricted 2-(1-pyrrolidinyl)-N-[2-(3,4-dichlorophenyl)ethyl]-N-methylethylenediam ines as sigma receptor ligands. 1. Pyrrolidine, piperidine, homopiperidine, and tetrahydroisoquinoline classes. J Med Chem35:4334-43 (1992) Sigma non-opioid intracellular receptor 1
Name:Sigma non-opioid intracellular receptor 1
Type:Enzyme Catalytic Domain
Mol. Mass.:25124.85
Organism:Homo sapiens (Human)
Description:Q99720
Residue:223
BDBM50000069
NameBDBM50000069
Synonyms:CHEMBL20377 | [2-(3,4-Dichloro-phenyl)-ethyl]-methyl-(2-pyrrolidin-1-yl-ethyl)-amine
TypeSmall organic molecule
Emp. Form.C15H22Cl2N2
Mol. Mass.301.255
SMILESCN(CCN1CCCC1)CCc1ccc(Cl)c(Cl)c1