Reaction Details
TargetMetabotropic glutamate receptor 2
LigandBDBM50244201
Substrate/Competitorn/a
Meas. Tech.ChEMBL_1673188 (CHEMBL4023217)
Ki 55±n/a nM
Citation Monn, JAHenry, SSMassey, SMClawson, DKChen, QDiseroad, BABhardwaj, RMAtwell, SLu, FWang, JRussell, MHeinz, BAWang, XSCarter, JHGetman, BGAdragni, KBroad, LMSanger, HEUrsu, DCatlow, JTSwanson, SJohnson, BGShaw, DBMcKinzie, DLHao, J Synthesis and Pharmacological Characterization of C4 J Med Chem61:2303-2328 (2018) 
 
Metabotropic glutamate receptor 2
Name:Metabotropic glutamate receptor 2
Type:Enzyme
Mol. Mass.:95584.88
Organism:Homo sapiens (Human)
Description:Q14416
Residue:872
BDBM50244201
NameBDBM50244201
Synonyms:CHEMBL4070866
TypeSmall organic molecule
Emp. Form.C15H16N2O6
Mol. Mass.320.2973
SMILES[H][C@]12[C@H](C(O)=O)[C@@]1([H])[C@@](N)(C[C@@H]2NC(=O)c1ccc(O)cc1)C(O)=O