Reaction Details
TargetMu-type opioid receptor
LigandBDBM50244285
Substrate/Competitorn/a
Meas. Tech.ChEMBL_1673553 (CHEMBL4023582)
Ki 50119±n/a nM
Citation Dolles, DHoffmann, MGunesch, SMarinelli, OMöller, JSantoni, GChatonnet, ALohse, MJWittmann, HJStrasser, ANabissi, MMaurice, TDecker, M Structure-Activity Relationships and Computational Investigations into the Development of Potent and Balanced Dual-Acting Butyrylcholinesterase Inhibitors and Human Cannabinoid Receptor 2 Ligands with Pro-Cognitive in Vivo Profiles. J Med Chem61:1646-1663 (2018) 
 
Mu-type opioid receptor
Name:Mu-type opioid receptor
Type:G Protein-Coupled Receptor (GPCR)
Mol. Mass.:44789.51
Organism:Homo sapiens (Human)
Description:P35372
Residue:400
BDBM50244285
NameBDBM50244285
Synonyms:CHEMBL4079520
TypeSmall organic molecule
Emp. Form.C25H34N4O2
Mol. Mass.422.5631
SMILESCCOc1ccc(Nc2nc3cc(ccc3n2CCC(C)C)C(=O)N(CC)CC)cc1