Reaction Details
TargetPeroxisome proliferator-activated receptor gamma
LigandBDBM50030474
Substrate/Competitorn/a
Meas. Tech.ChEMBL_1673639 (CHEMBL4023668)
EC50 332±n/a nM
Citation Boubia, BPoupardin, OBarth, MBinet, JPeralba, PMounier, LJacquier, EGauthier, ELepais, VChatar, MFerry, SThourigny, AGuillier, FLlacer, JAmaudrut, JDodey, PLacombe, OMasson, PMontalbetti, CWettstein, GLuccarini, JMLegendre, CJunien, JLBroqua, P Design, Synthesis, and Evaluation of a Novel Series of Indole Sulfonamide Peroxisome Proliferator Activated Receptor (PPAR)?/?/? Triple Activators: Discovery of Lanifibranor, a New Antifibrotic Clinical Candidate. J Med Chem61:2246-2265 (2018) 
 
Peroxisome proliferator-activated receptor gamma
Name:Peroxisome proliferator-activated receptor gamma
Type:Nuclear Receptor
Mol. Mass.:57613.46
Organism:Homo sapiens (Human)
Description:P37231
Residue:505
BDBM50030474
NameBDBM50030474
Synonyms:Avandamet Avandia CHEBI:50122 US10744117, Compound Rosiglitazone | US9562012, rosiglitazone
TypeSmall organic molecule
Emp. Form.C18H19N3O3S
Mol. Mass.357.427
SMILESCN(CCOc1ccc(CC2SC(=O)NC2=O)cc1)c1ccccn1