Reaction Details
TargetTyrosine-protein kinase BTK
LigandBDBM50244465
Substrate/Competitorn/a
Meas. Tech.ChEMBL_1673668 (CHEMBL4023697)
Ki 6.9±n/a nM
Citation Crawford, JJJohnson, ARMisner, DLBelmont, LDCastanedo, GChoy, RCoraggio, MDong, LEigenbrot, CErickson, RGhilardi, NHau, JKatewa, AKohli, PBLee, WLubach, JWMcKenzie, BSOrtwine, DFSchutt, LTay, SWei, BReif, KLiu, LWong, HYoung, WB Discovery of GDC-0853: A Potent, Selective, and Noncovalent Bruton's Tyrosine Kinase Inhibitor in Early Clinical Development. J Med Chem61:2227-2245 (2018) 
 
Tyrosine-protein kinase BTK
Name:Tyrosine-protein kinase BTK
Type:Enzyme
Mol. Mass.:76289.95
Organism:Homo sapiens (Human)
Description:Q06187
Residue:659
BDBM50244465
NameBDBM50244465
Synonyms:CHEMBL4075253
TypeSmall organic molecule
Emp. Form.C35H40N8O4
Mol. Mass.636.7433
SMILESCn1cc(cc(Nc2ccc(cn2)N2CCN(CC2)C2COC2)c1=O)-c1nccc(N2CCn3c4CCCCc4cc3C2=O)c1CO