Reaction Details
TargetTyrosine-protein kinase BTK
LigandBDBM50244487
Substrate/Competitorn/a
Meas. Tech.ChEMBL_1673668 (CHEMBL4023697)
Ki 4.0±n/a nM
Citation Crawford, JJJohnson, ARMisner, DLBelmont, LDCastanedo, GChoy, RCoraggio, MDong, LEigenbrot, CErickson, RGhilardi, NHau, JKatewa, AKohli, PBLee, WLubach, JWMcKenzie, BSOrtwine, DFSchutt, LTay, SWei, BReif, KLiu, LWong, HYoung, WB Discovery of GDC-0853: A Potent, Selective, and Noncovalent Bruton's Tyrosine Kinase Inhibitor in Early Clinical Development. J Med Chem61:2227-2245 (2018) 
 
Tyrosine-protein kinase BTK
Name:Tyrosine-protein kinase BTK
Type:Enzyme
Mol. Mass.:76289.95
Organism:Homo sapiens (Human)
Description:Q06187
Residue:659
BDBM50244487
NameBDBM50244487
Synonyms:CHEMBL4079803
TypeSmall organic molecule
Emp. Form.C36H41F3N8O3
Mol. Mass.690.7577
SMILESCn1cc(cc(Nc2ccc(cn2)N2CCN(CCC(F)(F)F)CC2)c1=O)-c1ccnc(N2CCn3c4CC(C)(C)Cc4cc3C2=O)c1CO