Reaction Details
TargetTyrosine-protein kinase BTK
LigandBDBM111951
Substrate/Competitorn/a
Meas. Tech.ChEMBL_1673668 (CHEMBL4023697)
Ki 0.350000±n/a nM
Citation Crawford, JJJohnson, ARMisner, DLBelmont, LDCastanedo, GChoy, RCoraggio, MDong, LEigenbrot, CErickson, RGhilardi, NHau, JKatewa, AKohli, PBLee, WLubach, JWMcKenzie, BSOrtwine, DFSchutt, LTay, SWei, BReif, KLiu, LWong, HYoung, WB Discovery of GDC-0853: A Potent, Selective, and Noncovalent Bruton's Tyrosine Kinase Inhibitor in Early Clinical Development. J Med Chem61:2227-2245 (2018) 
 
Tyrosine-protein kinase BTK
Name:Tyrosine-protein kinase BTK
Type:Enzyme
Mol. Mass.:76289.95
Organism:Homo sapiens (Human)
Description:Q06187
Residue:659
BDBM111951
NameBDBM111951
Synonyms:US8618107, 197
TypeSmall organic molecule
Emp. Form.C34H38FN7O3
Mol. Mass.611.709
SMILESCN1CCN(CC1)c1ccc(Nc2cc(cn(C)c2=O)-c2cc(F)cc(N3CCn4c5CCCCc5cc4C3=O)c2CO)nc1