Reaction Details
TargetTyrosine-protein kinase BTK
LigandBDBM50244440
Substrate/Competitorn/a
Meas. Tech.ChEMBL_1673668 (CHEMBL4023697)
Ki 0.910000±n/a nM
Citation Crawford, JJJohnson, ARMisner, DLBelmont, LDCastanedo, GChoy, RCoraggio, MDong, LEigenbrot, CErickson, RGhilardi, NHau, JKatewa, AKohli, PBLee, WLubach, JWMcKenzie, BSOrtwine, DFSchutt, LTay, SWei, BReif, KLiu, LWong, HYoung, WB Discovery of GDC-0853: A Potent, Selective, and Noncovalent Bruton's Tyrosine Kinase Inhibitor in Early Clinical Development. J Med Chem61:2227-2245 (2018) 
 
Tyrosine-protein kinase BTK
Name:Tyrosine-protein kinase BTK
Type:Enzyme
Mol. Mass.:76289.95
Organism:Homo sapiens (Human)
Description:Q06187
Residue:659
BDBM50244440
NameBDBM50244440
Synonyms:CHEMBL4065122
TypeSmall organic molecule
Emp. Form.C37H44N8O4
Mol. Mass.664.7965
SMILESC[C@H]1CN(CCN1c1ccc(Nc2cc(cn(C)c2=O)-c2ccnc(N3CCn4c5CC(C)(C)Cc5cc4C3=O)c2CO)nc1)C1COC1