Reaction Details
TargetCarbonic anhydrase 9
LigandBDBM50163867
Substrate/Competitorn/a
Meas. Tech.ChEMBL_1673892 (CHEMBL4023921)
Kd 0.33±n/a nM
Citation Linkuvien?, VTalibov, VODanielson, UHMatulis, D Introduction of Intrinsic Kinetics of Protein-Ligand Interactions and Their Implications for Drug Design. J Med Chem61:2292-2302 (2018) 
 
Carbonic anhydrase 9
Name:Carbonic anhydrase 9
Type:Enzyme
Mol. Mass.:49669.03
Organism:Homo sapiens (Human)
Description:Catalytic domain of human cloned isozyme was used in the assay
Residue:459
BDBM50163867
NameBDBM50163867
Synonyms:CHEMBL2443189 | carbonic anhydrase (CA) inhibitors, benzenesulphonamide ligand, 9
TypeSmall organic molecule
Emp. Form.C12H11N3O3S2
Mol. Mass.309.364
SMILESNS(=O)(=O)c1cccc(c1)C(=O)CSc1ncccn1