Reaction Details
TargetCarbonic anhydrase 2
LigandBDBM50163861
Substrate/Competitorn/a
Meas. Tech.ChEMBL_1673897 (CHEMBL4023926)
Kd 1±n/a nM
Citation Linkuvien?, VTalibov, VODanielson, UHMatulis, D Introduction of Intrinsic Kinetics of Protein-Ligand Interactions and Their Implications for Drug Design. J Med Chem61:2292-2302 (2018) 
 
Carbonic anhydrase 2
Name:Carbonic anhydrase 2
Type:Enzyme
Mol. Mass.:29250.71
Organism:Homo sapiens (Human)
Description:P00918
Residue:260
BDBM50163861
NameBDBM50163861
Synonyms:CHEMBL3799945 | carbonic anhydrase (CA) inhibitors, benzenesulphonamide ligand, 15
TypeSmall organic molecule
Emp. Form.C14H12F4N2O3S
Mol. Mass.364.315
SMILESCOc1ccc(CNc2c(F)c(F)c(F)c(F)c2S(N)(=O)=O)cc1