Reaction Details
TargetCarbonic anhydrase 9
LigandBDBM50031588
Substrate/Competitorn/a
Meas. Tech.ChEMBL_1673892 (CHEMBL4023921)
Kd 0.000019±n/a nM
Citation Linkuvien?, VTalibov, VODanielson, UHMatulis, D Introduction of Intrinsic Kinetics of Protein-Ligand Interactions and Their Implications for Drug Design. J Med Chem61:2292-2302 (2018) 
 
Carbonic anhydrase 9
Name:Carbonic anhydrase 9
Type:Enzyme
Mol. Mass.:49669.03
Organism:Homo sapiens (Human)
Description:Catalytic domain of human cloned isozyme was used in the assay
Residue:459
BDBM50031588
NameBDBM50031588
Synonyms:CHEMBL3359181
TypeSmall organic molecule
Emp. Form.C16H23F3N2O5S2
Mol. Mass.444.489
SMILESNS(=O)(=O)c1c(F)c(F)c(c(NC2CCCCCCC2)c1F)S(=O)(=O)CCO