Reaction Details
Target5'-AMP-activated protein kinase catalytic subunit alpha-1/subunit beta-1/subunit gamma-1
LigandBDBM237958
Substrate/Competitorn/a
Meas. Tech.ChEMBL_1673935 (CHEMBL4023964)
Kd 22±n/a nM
Citation Edmonds, DJKung, DWKalgutkar, ASFilipski, KJEbner, DCCabral, SSmith, ACAspnes, GEBhattacharya, SKBorzilleri, KABrown, JACalabrese, MFCaspers, NLCokorinos, ECConn, ELDowling, MSEng, HFeng, BFernando, DPGenung, NEHerr, MKurumbail, RGLavergne, SYLee, ECLi, QMathialagan, SMiller, RAPanteleev, JPolivkova, JRajamohan, FReyes, ARSalatto, CTShavnya, AThuma, BATu, MWard, JWithka, JMXiao, JCameron, KO Optimization of Metabolic and Renal Clearance in a Series of Indole Acid Direct Activators of 5'-Adenosine Monophosphate-Activated Protein Kinase (AMPK). J Med Chem61:2372-2383 (2018) 
 
5'-AMP-activated protein kinase catalytic subunit alpha-1/subunit beta-1/subunit gamma-1
Name:5'-AMP-activated protein kinase catalytic subunit alpha-1/subunit beta-1/subunit gamma-1
Type:n/a
Mol. Mass.:n/a
Description:n/a
Components:This complex has 0 components.
Component 1
Name:5'-AMP-activated protein kinase subunit beta-1
Synonyms:5'-AMP-activated protein kinase subunit beta-1 AMP-activated protein kinase alpha-2/beta-1/gamma-3 AMPK subunit beta-1 PRKAB1
Type:n/a
Mol. Mass.:30380.94
Organism:Homo sapiens (Human)
Description:Q9Y478
Residue:270
Component 2
Name:5'-AMP-activated protein kinase subunit gamma-1
Synonyms:5'-AMP-activated protein kinase subunit gamma-1 AMP-activated protein kinase, gamma-1 subunit AMPK gamma-1 AMPK subunit gamma-1 PRKAG1
Type:n/a
Mol. Mass.:37581.44
Organism:Homo sapiens (Human)
Description:P54619
Residue:331
Component 3
Name:5'-AMP-activated protein kinase catalytic subunit alpha-1
Synonyms:AAPK1_HUMAN AMP-activated protein kinase alpha-1/beta-2/gamma-2 AMPK subunit alpha-1 AMPK1 PRKAA1 | Tau-protein kinase PRKAA1
Type:Protein
Mol. Mass.:64023.62
Organism:Homo sapiens (Human)
Description:Q13131
Residue:559
BDBM237958
NameBDBM237958
Synonyms:US9394285, 39
TypeSmall organic molecule
Emp. Form.C22H23ClN2O4
Mol. Mass.414.882
SMILESOC(=O)c1c[nH]c2cc(Cl)c(cc12)-c1ccc(OCCCN2CCOCC2)cc1